android

#android#

已有121人关注此标签

内容分类

SmallAn

Android OSS SDk 上传文件报错divide by zero

使用VODUploadClient和OSS SDK 上传文件失败onUploadFailed信息: onUploadFailed=====codeClientException msg==com.alibaba.sdk.android.oss.ClientException: divide by zero [ErrorMessage]: java.lang.ArithmeticException: divide by zero

游客jvqfylvxkbvrg

getAcsResponse(request) 出错 Failed resolution of: Ljavax/xml/bind/DatatypeConverter;

Process: com.live.live, PID: 30455 java.lang.NoClassDefFoundError: Failed resolution of: Ljavax/xml/bind/DatatypeConverter; at com.aliyuncs.auth.HmacSHA1Signer.signString(HmacSHA1Signer.java:22) at com.aliyuncs.RpcAcsRequest.signRequest(RpcAcsRequest.java:158) at com.aliyuncs.DefaultAcsClient.doAction(DefaultAcsClient.java:247) at com.aliyuncs.DefaultAcsClient.doAction(DefaultAcsClient.java:180) at com.aliyuncs.DefaultAcsClient.doAction(DefaultAcsClient.java:77) at com.aliyuncs.DefaultAcsClient.getAcsResponse(DefaultAcsClient.java:106) at com.player.player.StsServiceSample.main(StsServiceSample.java:49) at com.player.player.AliyunPlayerSkinActivity.requestMpsSts(AliyunPlayerSkinActivity.java:191) at com.player.player.AliyunPlayerSkinActivity.onCreate(AliyunPlayerSkinActivity.java:166) at android.app.Activity.performCreate(Activity.java:6845) at android.app.Instrumentation.callActivityOnCreate(Instrumentation.java:1119) at android.app.ActivityThread.performLaunchActivity(ActivityThread.java:2700) at android.app.ActivityThread.handleLaunchActivity(ActivityThread.java:2808) at android.app.ActivityThread.-wrap12(ActivityThread.java) at android.app.ActivityThread$H.handleMessage(ActivityThread.java:1541) at android.os.Handler.dispatchMessage(Handler.java:102) at android.os.Looper.loop(Looper.java:165) at android.app.ActivityThread.main(ActivityThread.java:6375) at java.lang.reflect.Method.invoke(Native Method) at com.android.internal.os.ZygoteInit$MethodAndArgsCaller.run(ZygoteInit.java:912) at com.android.internal.os.ZygoteInit.main(ZygoteInit.java:802) Caused by: java.lang.ClassNotFoundException: Didn't find class "javax.xml.bind.DatatypeConverter" on path: DexPathList[[zip file "/data/app/com.live.live-1/base.apk"],nativeLibraryDirectories=[/data/app/com.live.live-1/lib/arm64, /data/app/com.live.live-1/base.apk!/lib/arm64-v8a, /system/lib64, /vendor/lib64]] at dalvik.system.BaseDexClassLoader.findClass(BaseDexClassLoader.java:74) at java.lang.ClassLoader.loadClass(ClassLoader.java:380) at java.lang.ClassLoader.loadClass(ClassLoader.java:312) at com.aliyuncs.auth.HmacSHA1Signer.signString(HmacSHA1Signer.java:22)  at com.aliyuncs.RpcAcsRequest.signRequest(RpcAcsRequest.java:158)  at com.aliyuncs.DefaultAcsClient.doAction(DefaultAcsClient.java:247)  at com.aliyuncs.DefaultAcsClient.doAction(DefaultAcsClient.java:180)  at com.aliyuncs.DefaultAcsClient.doAction(DefaultAcsClient.java:77)  at com.aliyuncs.DefaultAcsClient.getAcsResponse(DefaultAcsClient.java:106)  at com.player.player.StsServiceSample.main(StsServiceSample.java:49)  at com.player.player.AliyunPlayerSkinActivity.requestMpsSts(AliyunPlayerSkinActivity.java:191)  at com.player.player.AliyunPlayerSkinActivity.onCreate(AliyunPlayerSkinActivity.java:166)  at android.app.Activity.performCreate(Activity.java:6845)  at android.app.Instrumentation.callActivityOnCreate(Instrumentation.java:1119)  at android.app.ActivityThread.performLaunchActivity(ActivityThread.java:2700)  at android.app.ActivityThread.handleLaunchActivity(ActivityThread.java:2808)  at android.app.ActivityThread.-wrap12(ActivityThread.java)  at android.app.ActivityThread$H.handleMessage(ActivityThread.java:1541)  at android.os.Handler.dispatchMessage(Handler.java:102)  at android.os.Looper.loop(Looper.java:165)  at android.app.ActivityThread.main(ActivityThread.java:6375)  at java.lang.reflect.Method.invoke(Native Method)  at com.android.internal.os.ZygoteInit$MethodAndArgsCaller.run(ZygoteInit.java:912)  at com.android.internal.os.ZygoteInit.main(ZygoteInit.java:802)  我请求的参数应该没问题 不知道为什么就是发不通

shangdao

想在一个javaweb项目中打包另一个使用gradle构建的android项目生成apk,该如何做呢

最近工作需要在一个javaweb项目中打包生成apk,然后android是另一个项目,里面通过gradle进行构建,我觉得可以用gradle脚本进行构建,但是对java如何去执行gradle的脚本然后把打包出来的apk找到不是很清楚,麻烦各位大佬支个招,谢谢!!

萌新怕弯路

物联网云端client.getAcsResponse(request);在安卓中使用的问题

在java环境里没问题 ,3.5.1和6.7.0;但是需要我在安卓调通这个demo,所以我把他移植进了安卓,各种环境问题,我都差缺补缺 最后这个语句的返回会被try catch 捕捉,但是信息是null;

萌新怕弯路

安卓Caused by: java.lang.NullPointerException: Attempt to invoke interface method 'java.lang.String javax.xml.bind.DatatypeConverterInterface.printBase64Binary(byte[])' on a null object reference

PubResponse response = client.getAcsResponse(request);实例化这个的时候 try { String accessKey = "*"; String accessSecret = "*"; DefaultProfile.addEndpoint( "cn-shanghai", "Iot", "iot.cn-shanghai.aliyuncs.com"); IClientProfile profile = DefaultProfile.getProfile("cn-shanghai", accessKey, accessSecret); DefaultAcsClient client = new DefaultAcsClient(profile); //初始化SDK客户端 PubRequest request = new PubRequest(); request.setProductKey("a17oCIdyJso"); request.setMessageContent(android.util.Base64.encodeToString("hello world".getBytes(), android.util.Base64.DEFAULT)); request.setTopicFullName("/a17oCIdyJso/emw3290/get"); request.setQos(0); //目前支持QoS0和QoS1 PubResponse response = client.getAcsResponse(request); System.out.println(response.getSuccess()); System.out.println(response.getErrorMessage()); } catch (ServerException e) { e.printStackTrace(); } catch (ClientException e) { e.printStackTrace(); } 大佬说了是不是空的问题,我再加一个吧

棋seven

h5如何获取剪切板内容?

h5能不能通过js或者别的方式获取手机剪切板的内容,兼容Android和ios。

游客aqpqenklvwob2

so找不到

android application里面的代码:@Override public void onCreate() { super.onCreate(); QupaiHttpFinal.getInstance().initOkHttpFinal(); AlivcSdkCore.register(getApplicationContext()); AlivcSdkCore.setLogLevel(AlivcSdkCore.AlivcLogLevel.AlivcLogDebug); } 错误日志:java.lang.UnsatisfiedLinkError: dalvik.system.PathClassLoader[DexPathList[[zip file "/data/app/com.media.edit-1/base.apk", zip file "/data/app/com.media.edit-1/split_lib_dependencies_apk.apk", zip file "/data/app/com.media.edit-1/split_lib_slice_0_apk.apk", zip file "/data/app/com.media.edit-1/split_lib_slice_1_apk.apk", zip file "/data/app/com.media.edit-1/split_lib_slice_2_apk.apk", zip file "/data/app/com.media.edit-1/split_lib_slice_3_apk.apk", zip file "/data/app/com.media.edit-1/split_lib_slice_4_apk.apk", zip file "/data/app/com.media.edit-1/split_lib_slice_5_apk.apk", zip file "/data/app/com.media.edit-1/split_lib_slice_6_apk.apk", zip file "/data/app/com.media.edit-1/split_lib_slice_7_apk.apk", zip file "/data/app/com.media.edit-1/split_lib_slice_8_apk.apk", zip file "/data/app/com.media.edit-1/split_lib_slice_9_apk.apk"],nativeLibraryDirectories=[/data/app/com.media.edit-1/lib/arm, /data/app/com.media.edit-1/base.apk!/lib/armeabi-v7a, /data/app/com.media.edit-1/split_lib_dependencies_apk.apk!/lib/armeabi-v7a, /data/app/com.media.edit-1/split_lib_slice_0_apk.apk!/lib/armeabi-v7a, /data/app/com.media.edit-1/split_lib_slice_1_apk.apk!/lib/armeabi-v7a, /data/app/com.media.edit-1/split_lib_slice_2_apk.apk!/lib/armeabi-v7a, /data/app/com.media.edit-1/split_lib_slice_3_apk.apk!/lib/armeabi-v7a, /data/app/com.media.edit-1/split_lib_slice_4_apk.apk!/lib/armeabi-v7a, /data/app/com.media.edit-1/split_lib_slice_5_apk.apk!/lib/armeabi-v7a, /data/app/com.media.edit-1/split_lib_slice_6_apk.apk!/lib/armeabi-v7a, /data/app/com.media.edit-1/split_lib_slice_7_apk.apk!/lib/armeabi-v7a, /data/app/com.media.edit-1/split_lib_slice_8_apk.apk!/lib/armeabi-v7a, /data/app/com.media.edit-1/split_lib_slice_9_apk.apk!/lib/armeabi-v7a, /system/lib, /vendor/lib]]] couldn't find "libalivc_conan.so" at java.lang.Runtime.loadLibrary0(Runtime.java:972) at java.lang.System.loadLibrary(System.java:1567) at com.aliyun.sys.AbstractNativeLoader.loadLocalLibrary(SourceFile:75) at com.aliyun.sys.AbstractNativeLoader.<clinit>(SourceFile:34) at com.aliyun.sys.AlivcSdkCore.register(SourceFile:52) at com.media.edit.App.onCreate(App.java:45) at android.app.Instrumentation.callApplicationOnCreate(Instrumentation.java:1032) at android.app.ActivityThread.handleBindApplication(ActivityThread.java:5876) at android.app.ActivityThread.-wrap3(ActivityThread.java) at android.app.ActivityThread$H.handleMessage(ActivityThread.java:1699) at android.os.Handler.dispatchMessage(Handler.java:102) at android.os.Looper.loop(Looper.java:154) at android.app.ActivityThread.main(ActivityThread.java:6682) at java.lang.reflect.Method.invoke(Native Method) at com.android.internal.os.ZygoteInit$MethodAndArgsCaller.run(ZygoteInit.java:1520) at com.android.internal.os.ZygoteInit.main(ZygoteInit.java:1410) 2019-02-28 10:28:02.480 5390-5390/com.media.edit E/AliYunLog: Load .so failed! java.lang.UnsatisfiedLinkError: dlopen failed: library "libcurl.so" not found at java.lang.Runtime.loadLibrary0(Runtime.java:977) at java.lang.System.loadLibrary(System.java:1567) at com.aliyun.sys.AbstractNativeLoader.loadLocalLibrary(SourceFile:75) at com.aliyun.sys.AbstractNativeLoader.<clinit>(SourceFile:44) at com.aliyun.sys.AlivcSdkCore.register(SourceFile:52) at com.media.edit.App.onCreate(App.java:45) at android.app.Instrumentation.callApplicationOnCreate(Instrumentation.java:1032) at android.app.ActivityThread.handleBindApplication(ActivityThread.java:5876) at android.app.ActivityThread.-wrap3(ActivityThread.java) at android.app.ActivityThread$H.handleMessage(ActivityThread.java:1699) at android.os.Handler.dispatchMessage(Handler.java:102) at android.os.Looper.loop(Looper.java:154) at android.app.ActivityThread.main(ActivityThread.java:6682) at java.lang.reflect.Method.invoke(Native Method) at com.android.internal.os.ZygoteInit$MethodAndArgsCaller.run(ZygoteInit.java:1520) at com.android.internal.os.ZygoteInit.main(ZygoteInit.java:1410) 2019-02-28 10:28:02.487 5390-5390/com.media.edit E/art: No implementation found for void com.aliyun.sys.AlivcSdkCore.nativeSetLogLevel(int) (tried Java_com_aliyun_sys_AlivcSdkCore_nativeSetLogLevel and Java_com_aliyun_sys_AlivcSdkCore_nativeSetLogLevel__I)2019-02-28 10:28:02.488 5390-5390/com.media.edit E/AndroidRuntime: FATAL EXCEPTION: main Process: com.media.edit, PID: 5390 java.lang.UnsatisfiedLinkError: No implementation found for void com.aliyun.sys.AlivcSdkCore.nativeSetLogLevel(int) (tried Java_com_aliyun_sys_AlivcSdkCore_nativeSetLogLevel and Java_com_aliyun_sys_AlivcSdkCore_nativeSetLogLevel__I) at com.aliyun.sys.AlivcSdkCore.nativeSetLogLevel(Native Method) at com.aliyun.sys.AlivcSdkCore.setLogLevel(SourceFile:62) at com.media.edit.App.onCreate(App.java:46) at android.app.Instrumentation.callApplicationOnCreate(Instrumentation.java:1032) at android.app.ActivityThread.handleBindApplication(ActivityThread.java:5876) at android.app.ActivityThread.-wrap3(ActivityThread.java) at android.app.ActivityThread$H.handleMessage(ActivityThread.java:1699) at android.os.Handler.dispatchMessage(Handler.java:102) at android.os.Looper.loop(Looper.java:154) at android.app.ActivityThread.main(ActivityThread.java:6682) at java.lang.reflect.Method.invoke(Native Method) at com.android.internal.os.ZygoteInit$MethodAndArgsCaller.run(ZygoteInit.java:1520) at com.android.internal.os.ZygoteInit.main(ZygoteInit.java:1410)

kylinarm

Unity3d游戏展示Dialog时返回桌面再进入游戏,游戏黑屏

Unity3d游戏展示Dialog时返回桌面再进入游戏,游戏黑屏。只有Unity3d的游戏才会出现

万学冬

Please check yw_0335.jpg getErrorCode:202

接入安全验证,老是提示203,后来改了gradle,变成202了,给我的图片明明叫yw_1222_0335.jpg,为什么跟我要yw_0335.jpg呢?什么意思?

游客ytrscnfas53c2

android 手表后台运行应用 mqtt 频繁离线

在Android 华为watch 2 手表上接入mqtt 3.1.1.0版本,在手表进入到待机模式,也就是将应用切换到后台执行,差不多切换后5分钟左右就会断开连接,但是在mqtt 设置中设置了自动重连,日志中并没有看到重连成功的日志信息,请问一下,当应用切换到后台,如何保证长连接?

承影1216

com.aliyun.iotx.linkvisionipc.IPCDev 实现多张图片上传

LinkVision IPC Android SDK 事件上报 如何实现多张图片上传

python小能手

为什么在Debian上使用pip安装textract失败?

我正在尝试textract在(dockerized)Debian上安装python包: FROM python:2.7RUN apt-get updateRUN apt-get -y upgradeRUN apt-get -y install libevent-dev python-dev libxml2-dev libxslt1-dev antiword unrtf poppler-utils pstotext tesseract-ocr flac ffmpeg lame libmad0 libsox-fmt-mp3 sox libjpeg-dev swigRUN pip install textract但它在最后一步失败了pip install textract。为什么?如何解决这个问题?以下是错误: Building wheels for collected packages: textract, python-pptx, docx2txt, xlrd, EbookLib, pocketsphinx Running setup.py bdist_wheel for textract: started Running setup.py bdist_wheel for textract: finished with status 'done' Stored in directory: /root/.cache/pip/wheels/7b/88/ca/fe02cca616f52ba41e11ee9eff08ca0d8391f3df35e0ede5e2 Running setup.py bdist_wheel for python-pptx: started Running setup.py bdist_wheel for python-pptx: finished with status 'done' Stored in directory: /root/.cache/pip/wheels/14/50/ec/bf4ff7cedffcde6ef29d3154f758a5d65f40427f526cbdb1d5 Running setup.py bdist_wheel for docx2txt: started Running setup.py bdist_wheel for docx2txt: finished with status 'done' Stored in directory: /root/.cache/pip/wheels/a8/a1/2e/61cea06f166c6f6ac4df4d75a409328406bd0d2f8e007592f9 Running setup.py bdist_wheel for xlrd: started Running setup.py bdist_wheel for xlrd: finished with status 'done' Stored in directory: /root/.cache/pip/wheels/f7/2e/62/b4b26f9bc16968996a93dab7a1ec3cf9a1c8ca409114f4fefe Running setup.py bdist_wheel for EbookLib: started Running setup.py bdist_wheel for EbookLib: finished with status 'done' Stored in directory: /root/.cache/pip/wheels/3a/b9/cb/834288199b3b3c6c08441d5780ce4a6cfc161d4c859f28a915 Running setup.py bdist_wheel for pocketsphinx: started Running setup.py bdist_wheel for pocketsphinx: finished with status 'error' Complete output from command /usr/local/bin/python -u -c "import setuptools, tokenize;__file__='/tmp/pip-install-rkBOkm/pocketsphinx/setup.py';f=getattr(tokenize, 'open', open)(__file__);code=f.read().replace('rn', 'n');f.close();exec(compile(code, __file__, 'exec'))" bdist_wheel -d /tmp/pip-wheel-lmkSIP --python-tag cp27: running bdist_wheel running build_ext building 'sphinxbase._ad' extension swigging swig/sphinxbase/ad.i to swig/sphinxbase/ad_wrap.c swig -python -modern -Ideps/sphinxbase/include -Ideps/sphinxbase/include/sphinxbase -Ideps/sphinxbase/include/android -Ideps/sphinxbase/swig -outdir sphinxbase -o swig/sphinxbase/ad_wrap.c swig/sphinxbase/ad.i creating build creating build/temp.linux-x86_64-2.7 creating build/temp.linux-x86_64-2.7/swig creating build/temp.linux-x86_64-2.7/swig/sphinxbase creating build/temp.linux-x86_64-2.7/deps creating build/temp.linux-x86_64-2.7/deps/sphinxbase creating build/temp.linux-x86_64-2.7/deps/sphinxbase/src creating build/temp.linux-x86_64-2.7/deps/sphinxbase/src/libsphinxad gcc -pthread -fno-strict-aliasing -g -O2 -DNDEBUG -g -fwrapv -O3 -Wall -Wstrict-prototypes -fPIC -DSPHINXBASE_EXPORTS -DPOCKETSPHINX_EXPORTS -DSPHINX_DLL -DHAVE_CONFIG_H -Ideps/sphinxbase/include -Ideps/sphinxbase/include/sphinxbase -Ideps/sphinxbase/include/android -I/usr/local/include/python2.7 -c swig/sphinxbase/ad_wrap.c -o build/temp.linux-x86_64-2.7/swig/sphinxbase/ad_wrap.o -Wno-unused-label -Wno-strict-prototypes -Wno-parentheses -Wno-unused-but-set-variable -Wno-unused-variable -Wno-unused-result -Wno-sign-compare -Wno-misleading-indentation gcc -pthread -fno-strict-aliasing -g -O2 -DNDEBUG -g -fwrapv -O3 -Wall -Wstrict-prototypes -fPIC -DSPHINXBASE_EXPORTS -DPOCKETSPHINX_EXPORTS -DSPHINX_DLL -DHAVE_CONFIG_H -Ideps/sphinxbase/include -Ideps/sphinxbase/include/sphinxbase -Ideps/sphinxbase/include/android -I/usr/local/include/python2.7 -c deps/sphinxbase/src/libsphinxad/ad_pulse.c -o build/temp.linux-x86_64-2.7/deps/sphinxbase/src/libsphinxad/ad_pulse.o -Wno-unused-label -Wno-strict-prototypes -Wno-parentheses -Wno-unused-but-set-variable -Wno-unused-variable -Wno-unused-result -Wno-sign-compare -Wno-misleading-indentation deps/sphinxbase/src/libsphinxad/ad_pulse.c:44:30: fatal error: pulse/pulseaudio.h: No such file or directory #include ^ compilation terminated. error: command 'gcc' failed with exit status 1 ---------------------------------------- Failed building wheel for pocketsphinx Running setup.py clean for pocketsphinxSuccessfully built textract python-pptx docx2txt xlrd EbookLibFailed to build pocketsphinxrequests 2.20.0 has requirement chardet<3.1.0,>=3.0.2, but you'll have chardet 2.3.0 which is incompatible.Installing collected packages: argcomplete, chardet, Pillow, XlsxWriter, python-pptx, docx2txt, beautifulsoup4, xlrd, six, EbookLib, SpeechRecognition, pocketsphinx, textract Found existing installation: chardet 3.0.4 Uninstalling chardet-3.0.4: Successfully uninstalled chardet-3.0.4 Found existing installation: beautifulsoup4 4.6.3 Uninstalling beautifulsoup4-4.6.3: Successfully uninstalled beautifulsoup4-4.6.3 Running setup.py install for pocketsphinx: started Running setup.py install for pocketsphinx: finished with status 'error' Complete output from command /usr/local/bin/python -u -c "import setuptools, tokenize;__file__='/tmp/pip-install-rkBOkm/pocketsphinx/setup.py';f=getattr(tokenize, 'open', open)(__file__);code=f.read().replace('\r\n', '\n');f.close();exec(compile(code, __file__, 'exec'))" install --record /tmp/pip-record-MiPh8Y/install-record.txt --single-version-externally-managed --compile: running install running build_ext building 'sphinxbase._ad' extension swigging swig/sphinxbase/ad.i to swig/sphinxbase/ad_wrap.c swig -python -modern -Ideps/sphinxbase/include -Ideps/sphinxbase/include/sphinxbase -Ideps/sphinxbase/include/android -Ideps/sphinxbase/swig -outdir sphinxbase -o swig/sphinxbase/ad_wrap.c swig/sphinxbase/ad.i creating build creating build/temp.linux-x86_64-2.7 creating build/temp.linux-x86_64-2.7/swig creating build/temp.linux-x86_64-2.7/swig/sphinxbase creating build/temp.linux-x86_64-2.7/deps creating build/temp.linux-x86_64-2.7/deps/sphinxbase creating build/temp.linux-x86_64-2.7/deps/sphinxbase/src creating build/temp.linux-x86_64-2.7/deps/sphinxbase/src/libsphinxad gcc -pthread -fno-strict-aliasing -g -O2 -DNDEBUG -g -fwrapv -O3 -Wall -Wstrict-prototypes -fPIC -DSPHINXBASE_EXPORTS -DPOCKETSPHINX_EXPORTS -DSPHINX_DLL -DHAVE_CONFIG_H -Ideps/sphinxbase/include -Ideps/sphinxbase/include/sphinxbase -Ideps/sphinxbase/include/android -I/usr/local/include/python2.7 -c swig/sphinxbase/ad_wrap.c -o build/temp.linux-x86_64-2.7/swig/sphinxbase/ad_wrap.o -Wno-unused-label -Wno-strict-prototypes -Wno-parentheses -Wno-unused-but-set-variable -Wno-unused-variable -Wno-unused-result -Wno-sign-compare -Wno-misleading-indentation gcc -pthread -fno-strict-aliasing -g -O2 -DNDEBUG -g -fwrapv -O3 -Wall -Wstrict-prototypes -fPIC -DSPHINXBASE_EXPORTS -DPOCKETSPHINX_EXPORTS -DSPHINX_DLL -DHAVE_CONFIG_H -Ideps/sphinxbase/include -Ideps/sphinxbase/include/sphinxbase -Ideps/sphinxbase/include/android -I/usr/local/include/python2.7 -c deps/sphinxbase/src/libsphinxad/ad_pulse.c -o build/temp.linux-x86_64-2.7/deps/sphinxbase/src/libsphinxad/ad_pulse.o -Wno-unused-label -Wno-strict-prototypes -Wno-parentheses -Wno-unused-but-set-variable -Wno-unused-variable -Wno-unused-result -Wno-sign-compare -Wno-misleading-indentation deps/sphinxbase/src/libsphinxad/ad_pulse.c:44:30: fatal error: pulse/pulseaudio.h: No such file or directory #include <pulse/pulseaudio.h> ^ compilation terminated. error: command 'gcc' failed with exit status 1 ---------------------------------------- Command "/usr/local/bin/python -u -c "import setuptools, tokenize;__file__='/tmp/pip-install-rkBOkm/pocketsphinx/setup.py';f=getattr(tokenize, 'open', open)(__file__);code=f.read().replace('rn', 'n');f.close();exec(compile(code, __file__, 'exec'))" install --record /tmp/pip-record-MiPh8Y/install-record.txt --single-version-externally-managed --compile" failed with error code 1 in /tmp/pip-install-rkBOkm/pocketsphinx/ERROR: Service 'baleen' failed to build: The command '/bin/sh -c pip install textract' returned a non-zero code: 1

gavin_lo

重启内核与重启系统的指令?

终端重启系统的指令有 reboot 等,今天在网上看到一篇旧文章,说linux 4.0 之后,有直接重启内核而不用重启系统的技术,请问有大牛对这一块有涉猎么?希望能不吝指教,或者有什么书籍、文档推荐的,也请留下墨宝,谢谢,不胜感激!

tanliang_focus

服务器进入bios系统把VT-x设置成enable状态

您好,我现在阿里云服务器安装了genymotion,可是需要CPU支持VT-x。所以我想把阿里云服务器windows server,进入bios系统把VT-x设置成enable状态。请问如何帮我处理?

good_good_study

android用热修复本地测试有效但是发布后无效

android用阿里的移动热修复,本地用hotfixdebug工具扫描测试有效,但是灰度或者全量发布后无效

夜雨十年灯

Android 投篮验证 Debug 测试没问题,Release 版本起不来

检查了安全图片,配置是正常的。然后看了报错log信息如下:

万维识别

智慧工地的人脸识别是怎么操作的?可以实现什么功能?

“智慧工地”的概念越来越热,人脸识别在智慧工地中的作用越来越大。而人脸识别技术在智慧工地中究竟是如何应用的?可以实现哪些功能?

黄二刀

[@炯轩][¥20]如何将React Native集成至Android原生应用?

如何将React Native集成至Android原生应用?

黄二刀

[@炯轩][¥20]android studio自带的模拟器运行起来非常卡,有没有什么比较好用的安卓模拟器?

android studio自带的模拟器运行起来非常卡,有没有什么比较好用的安卓模拟器?

nebula

[@炯轩][¥20]如何实现Android夜间模式

如何实现Android夜间模式?